[Dev-luatex] Revision 3779 build fails?

Graham Douglas graham.douglas at readytext.co.uk
Sat Jul 31 17:15:20 CEST 2010


Hi Taco

I have just downloaded revision 3779 and hit a build failure.
Below is the (hopefully) relevant section of the build process
log.

As usual, Windows Vista, MINGW32,

build.sh --nostrip

Seems to have been triggered by 
g:/LuaTeX/build/libs/poppler/poppler/GlobalParams.h:41:35: 
fontconfig/fontconfig
.h: No such file or directory

Line 41 of GlobalParams.h does try to include

#include <fontconfig/fontconfig.h>

Of course, let me know if you need more info etc.

Warm wishes

Graham

PS... Feel a bit guilty just reporting build failures rather
than more helpful suggestions/contributions.

===========================================================
g++ -DHAVE_CONFIG_H -I. -I../../../source/texk/web2c -I./w2c 
-I/beta/build/texk
  -I/beta/source/texk -DNO_DEBUG -I/beta/build/libs/zlib/include 
-I/beta/build/li
bs/libpng/include -DPDF_PARSER_ONLY -I/beta/build/libs/poppler 
-I/beta/build/lib
s/poppler/goo -I/beta/build/libs/poppler/poppler 
-I/beta/build/libs/obsdcompat -
I/beta/source/libs/obsdcompat -I../../../source/texk/web2c/libmd5 
-Iluatexdir -I
../../../source/texk/web2c/luatexdir 
-I../../../source/texk/web2c/luatexdir/lua5
1 -DpdfTeX   -g -O2 -MT libluatex_a-pdftoepdf.o -MD -MP -MF 
.deps/libluatex_a-pd
ftoepdf.Tpo -c -o libluatex_a-pdftoepdf.o `test -f 
'luatexdir/image/pdftoepdf.cc
' || echo '../../../source/texk/web2c/'`luatexdir/image/pdftoepdf.cc
In file included from ../../../source/texk/web2c/luatexdir/image/epdf.h:52,
                  from 
../../../source/texk/web2c/luatexdir/image/pdftoepdf.cc:27
:
g:/LuaTeX/build/libs/poppler/poppler/GlobalParams.h:41:35: 
fontconfig/fontconfig
.h: No such file or directory
In file included from ../../../source/texk/web2c/luatexdir/image/epdf.h:52,
                  from 
../../../source/texk/web2c/luatexdir/image/pdftoepdf.cc:27
:
g:/LuaTeX/build/libs/poppler/poppler/GlobalParams.h:356: error: ISO C++ 
forbids
declaration of `FcConfig' with no type
g:/LuaTeX/build/libs/poppler/poppler/GlobalParams.h:356: error: expected 
`;' bef
ore '*' token
make: *** [libluatex_a-pdftoepdf.o] Error 1
luatex binary not stripped
ls: build/texk/web2c/luatex.exe: No such file or directory






More information about the dev-luatex mailing list